{"text_format":"1","workbook":"xlsx","n_sheets":6,"sheets":["Instructions","Calculator","Sheet2","Sheet3","Sheet4","Sheet5"],"not_rendered":{"charts":0,"images":0,"macros":1,"external_links":0,"defined_names":0,"comments":0,"pivot_tables":0},"unopened":[],"bounds":{"document_bytes":16777216,"sheet_cells":100000,"rows_first":2000,"rows_last":500,"rows_between":2000,"halvings":0,"cell_chars":16384,"cell_head_chars":4096},"cells_cut":0,"cells_raw":0,"read":"whole","date_system":"1900"}

{"sheet":"Instructions","index":0,"n_rows":49,"n_cols":17,"rows_kept":49,"cut":false,"hidden":false,"merged":[[43,4,43,5],[43,6,43,14],[44,4,44,5],[44,6,44,14],[45,4,45,5],[45,6,45,14],[42,4,42,14],[35,4,35,14],[36,4,36,5],[36,6,36,14],[37,4,37,5],[37,6,37,14],[38,4,38,5],[38,6,38,14],[39,4,39,5],[39,6,39,14],[40,4,40,14],[41,4,41,5],[41,6,41,14],[32,4,32,5],[32,6,32,14],[33,4,33,5],[33,6,33,14],[34,4,34,5],[34,6,34,14],[31,4,31,5],[31,6,31,14],[25,4,25,5],[25,6,25,14],[26,4,26,5],[26,6,26,14],[27,4,27,5],[27,6,27,14],[28,4,28,5],[28,6,28,14],[29,4,29,5],[29,6,29,14],[30,4,30,14],[22,4,22,5],[22,6,22,14],[23,4,23,5],[23,6,23,14],[24,4,24,5],[24,6,24,14],[21,4,21,5],[21,6,21,14],[14,4,14,5],[14,6,14,14],[15,4,15,14],[16,4,16,5],[16,6,16,14],[17,4,17,5],[17,6,17,14],[18,4,18,5],[18,6,18,14],[19,4,19,14],[20,4,20,5],[20,6,20,14],[10,4,10,5],[10,6,10,14],[11,4,11,5],[11,6,11,14],[12,4,12,14],[7,6,7,14],[8,4,8,5],[8,6,8,14],[9,4,9,5],[9,6,9,14],[1,16,2,17],[4,16,11,17],[46,4,46,14],[47,4,47,5],[48,4,48,5],[47,6,47,14],[48,6,48,14],[1,4,2,14],[4,4,4,5],[4,6,4,14],[5,4,5,14],[6,4,6,5],[6,6,6,14],[13,4,13,5],[13,6,13,14],[7,4,7,5]]}
[]
[null,null,null,null,"Instructions for Warehouse Receipt Calculator for Peanuts",null,null,null,null,null,null,null,null,null,null,null,"Tools"]
[]
[]
[null,null,null,null,"Item",null,"Description",null,null,null,null,null,null,null,null,null,"The \"CLEAR CONTENTS\" button will allow you to clear all entries and selections on the workpage."]
[null,null,null,null,"A. Commodity Information"]
[null,null,null,null,"Crop Year",null,"Select the applicable crop year from the dropdown menu."]
[null,null,null,null,"Peanut",null,"List of Peanuts by Type."]
[null,null,null,null,"Support Rate per Ton",null,"Displays the National Loan Rate by type for the crop year selected."]
[null,null,null,null,"Value Per 1% of SMK",null,"Displays the SMK Rate by type for the crop year selected."]
[null,null,null,null,"Receipt Number",null,"Enter the receipt number."]
[null,null,null,null,"Peanut Type",null,"Select the peanut type from the dropdown menu."]
[null,null,null,null,"B. Loan Rate Information"]
[null,null,null,null,"1. Loan Rate",null,"Displays the NLR for the peanut type selected."]
[null,null,null,null,"2. Value Per % Total SMK",null,"Displays the SMK rate for the peanut type selected. Premiums and discounts are applied at the time of loan making. The value per percent of sound mature kernels is used to find the base loan rate before applying other premiums and discounts. "]
[null,null,null,null,"C. Loan Quantity (from Receipt)"]
[null,null,null,null,"3. Net Tons (Excluding LSK)",null,"Enter  the net tons excluding LSK from the warehouse receipt."]
[null,null,null,null,"4. LSK Tons",null,"Enter the LSK tons from the warehouse receipt."]
[null,null,null,null,"5. Loan Quantity",null,"Displays total tons for loan by taking the sum of Net Tons excluding LSK and LSK Tons. The calculated net loan rate including premiums and discounts is applied only to the net tons. The LSK (loose shelled kernels) value is calculated by multiplying the LSK tons by $140.00.  "]
[null,null,null,null,"D. Grade Factors (from Receipt)"]
[null,null,null,null,"6. Seg.",null,"Select the applicable grade or seg. From the dropdown menu. Peanuts are graded on a segregation basis of 1,2, or 3. Seg 2 and Seg 3 peanuts are eligible for loan at 35% of the NLR by type. "]
[null,null,null,null,"7. Moisture",null,"Enter the moisture % from the warehouse receipt."]
[null,null,null,null,"8. Foreign Material",null,"Enter the foreign material % from the warehouse receipt. Foreign Material % is used to calculate discounts applied to the net loan rate."]
[null,null,null,null,"9. Sound Splits",null,"Enter the sound splits % from the warehouse receipt. Sound Splits % is used to calculate discounts applied to the net loan rate. "]
[null,null,null,null,"10. Total SMK",null,"Enter the total SMK from the warehouse receipt. Total SMK is not to be confused with SMK. Total SMK is calculated by adding the SMK% and the Sound Splits%. It is shown on the warehouse receipt as Total SMK or SMKSS."]
[null,null,null,null,"11. Other Kernels",null,"Enter the other kernels % from the warehouse receipt. Other kernels are used to calculate premiums added to the base loan rate by multiplying OK% times $1.40."]
[null,null,null,null,"12. Damaged Kernels",null,"Enter the damaged kernels % from the warehouse receipt. Damaged Kernel % is used to calculate discounts applied to the net loan rate."]
[null,null,null,null,"13. Hulls",null,"Enter the hulls % from the warehouse receipt."]
[null,null,null,null,"14. Total Kernels & Hulls",null,"Enter the total kernels & hulls % from the warehouse receipt. Total kernels & hulls is listed grading factor,  calculated by adding the % of Total Kernels and the % of Hulls, and is shown on the warehouse receipt."]
[null,null,null,null,"15. ELK ",null,"Enter the ELK % from the warehouse receipt."]
[null,null,null,null,"E. Calculations"]
[null,null,null,null,"16. Total SMK",null,"Displays the base loan rate found by multiplying the Total SMK % and the SMK Rate for the applicable peanut type. "]
[null,null,null,null,"17. Other Kernel Premium",null,"Displays the calculated amount of Other Kernel premium found by multiplying the OK% times $1.40. Applicable for all peanut types. "]
[null,null,null,null,"18. ELK Premium",null,"Displays the calculated amount of ELK (Extra Long Kernel) premium found by multiplying the ELK % times 0.35. The ELK premium is only applicable to Virginia peanuts. "]
[null,null,null,null,"19. Total Kernel Value",null,"Displays the Total Kernel Value by adding the OK premium and ELK premium to the base loan rate. "]
[null,null,null,null,"F. Discounts"]
[null,null,null,null,"20. Damaged Kernels",null,"Displays the calculated amount of DK discount found by multiplying the DK % and the rate of discount shown in 2 LP Peanuts."]
[null,null,null,null,"21. Excess Foreign Material",null,"Displays the calculated amount of FM discount found by multiplying the FM % and the rate of discount shown in 2 LP Peanuts."]
[null,null,null,null,"22. Excess Splits",null,"Displays the calculated amount of SS discount found by multiplying the SS % and the rate of discount shown in 2 LP Peanuts. "]
[null,null,null,null,"23. Total Discount",null,"Displays the total discount to be applied to the base loan rate by adding calculated discounts for DK, FM, and SS. "]
[null,null,null,null,"G. Net Loan Rate Excluding LSK"]
[null,null,null,null,"24. Net Loan Rate Excl. LSK",null,"Displays the Net Loan Rate excl. LSK calculated by subtracting the total discounts from the Total Kernel Value. If Seg 2 peanut is selected, result will display as FALSE. See section \"I\"."]
[null,null,null,null,"H. Value Per Pound Including LSK"]
[null,null,null,null,"25. Value Excl. LSK",null,"Displays the Value excl. LSK calculated by multiplying the Net Loan Rate excl. LSK and the Net Tons excl. LSK. If Seg 2 peanut is selected, result will display as FALSE. See section \"I\"."]
[null,null,null,null,"26. Value of LSK",null,"Displays the Value of LSK calculated by multiplying the LSK Tons by $140.00. If Seg 2 peanut is selected, result will display as FALSE. See section \"I\"."]
[null,null,null,null,"27. Loan Amount / Receipt Loan Value",null,"Displays the Loan Amount / Receipt Loan Value calculated by adding the Value excl. LSK and the Value of LSK. Receipt Loan Value should match the value printed on paper warehouse receipts and the value shown on EWR receipts. Due to rounding of calculations, a $10 tolerance is acceptable. If Seg 2 peanut is selected, result will display as FALSE. See section \"I\"."]
[null,null,null,null,"I. Seg 2 & Seg 3 Value"]
[null,null,null,null,"28. Net Loan Rate (Seg 2 & 3)",null,"Displays the Net Loan Rate calculated by multiplying the loan rate of peanut type by 35%. If Seg 1 peanut is selected, result will display FALSE. See section \"H\"."]
[null,null,null,null,"29. Loan Amount / Receipt Loan Value (Seg 2 & 3)",null,"Displays the Loan Amount / Receipt Loan Value calculated by multiplying the Net Loan Rate for Seg 2 / Seg 3 by the Total Tons. If Seg 1 peanut is selected, result will display as FALSE. See section \"H\"."]

{"sheet":"Calculator","index":1,"n_rows":39,"n_cols":7,"rows_kept":39,"cut":false,"hidden":false,"merged":[[34,0,34,2],[10,4,10,6],[13,4,13,6],[7,0,7,1],[8,0,8,1],[10,0,10,2],[14,0,14,2],[18,0,18,2],[29,0,29,2],[18,4,18,6]]}
["Crop Year"]
["Peanut","Support Rate per Ton","Value Per 1 % of SMK"]
["Runner ",{"$f":"SUMIFS(Sheet2!F2:F40,Sheet2!E2:E40,B1,Sheet2!D2:D40,A3)","v":0},{"$f":"SUMIFS(Sheet2!G2:G40,Sheet2!E2:E40,B1,Sheet2!D2:D40,A3)","v":0}]
["Spanish",{"$f":"SUMIFS(Sheet2!F2:F40,Sheet2!E2:E40,B1,Sheet2!D2:D40,A4)","v":0},{"$f":"SUMIFS(Sheet2!G2:G40,Sheet2!E2:E40,B1,Sheet2!D2:D40,A4)","v":0}]
["Valencia",{"$f":"SUMIFS(Sheet2!F2:F40,Sheet2!E2:E40,B1,Sheet2!D2:D40,A5)","v":0},{"$f":"SUMIFS(Sheet2!G2:G40,Sheet2!E2:E40,B1,Sheet2!D2:D40,A5)","v":0}]
["Virginia",{"$f":"SUMIFS(Sheet2!F2:F40,Sheet2!E2:E40,B1,Sheet2!D2:D40,A6)","v":0},{"$f":"SUMIFS(Sheet2!G2:G40,Sheet2!E2:E40,B1,Sheet2!D2:D40,A6)","v":0}]
[]
["Receipt Number"]
["Peanut Type",null,"Runner "]
[]
["Warehouse Stored Seg 1 Peanuts",null,null,null,"Net Loan Rate Excluding LSK"]
["Line","Description","Amount",null,"Line","Description","Amount"]
[1,"Loan Rate",{"$f":"SUMIF(A2:A6,C9,B2:B6)","v":0},null,24,"Net Loan Rate Excl. LSK (Line 19 - Line 23)",{"$f":"IF(C20=1,C34-C39)","v":false}]
[2,"Value Per % Total SMK",{"$f":"SUMIF(A2:A6,C9,C2:C6)","v":0},null,"Vale Per Pound Including LSK"]
["Loan quantity (from Receipt)",null,null,null,25,"Value Excl. LSK (Line 3 x Line 24)",{"$f":"IF(C20=0,0,IF(C20=1,SUM(C16*G13)))","v":0}]
[3,"Net Tons (Excluding LSK)",null,null,26,"Value of LSK (Line 4 x $140.00)",{"$f":"IF(C20=0,0,IF(C20=1,SUM(C17*140)))","v":0}]
[4,"LSK Tons",null,null,27,"Loan Amount / Receipt Loan Value (Line 25 + Line 26)",{"$f":"SUM(G15:G16)","v":0}]
[5,"Loan Quanitty - Total Tons (Line 3 + Line 4)",{"$f":"SUM(C16:C17)","v":0}]
["Grade Factors (from Receipt)",null,null,null,"Seg 2 & Seg 3 Value"]
[6,"Seg.",null,null,28,"Net Loan Rate (Line 13 x 35 %)",{"$f":"IF(OR(C20=2,C20=3),C13*0.35)","v":false}]
[7,"Moisture",null,null,29,"Loan Amount / Receipt Value (Line 28 x Line 5)",{"$f":"SUM(G20*C18)","v":0}]
[8,"Foreign Material"]
[9,"Sound Splits"]
[10,"Total Sound Mature Kernels"]
[11,"Other Kernels"]
[12,"Damaged Kernels"]
[13,"Hulls"]
[14,"Total Kernels + Hulls "]
[15,"ELK (Virginia Peanuts Only)"]
["Calculations"]
[16,"Total SMK (Line 10 x Line 2)",{"$f":"C24*C14","v":0}]
[17,"Other Kernel (Line 11 x $1.40)",{"$f":"C25*1.4","v":0}]
[18,"ELK - Virginia Peanuts Only (Line 15 x 0.35)",{"$f":"C29*0.35","v":0}]
[19,"Total Kernel Value (Line 16 + Line 17 + Line 18)",{"$f":"SUM(C31:C33)","v":0}]
["Discounts"]
[20,"Damaged Kernels (%DMG x Rate from Discount Table)",{"$f":"SUMIF(Sheet3!A1:A349,C26,Sheet3!B1:B349)","v":0}]
[21,"Excess FM (%FM x Rate from Discount Table)",{"$f":"SUMIF(Sheet4!A1:A2049,C22,Sheet4!B1:B2049)","v":0}]
[22,"Excess Splits (%SS x Rate from Discount Table)",{"$f":"SUMIF(Sheet5!A1:A1749,C23,Sheet5!B1:B1749)","v":0}]
[23,"Total Discount",{"$f":"SUM(C36:C38)","v":0}]

{"sheet":"Sheet2","index":2,"n_rows":25,"n_cols":9,"rows_kept":25,"cut":false,"hidden":false,"merged":[]}
[null,null,null,null,"Crop Year","NLR","SMK"]
[null,"Runner ",null,"Runner ",2019,354.13,4.8079999999999998,null,1]
[null,"Spanish",null,"Spanish",2019,346.7,4.7839999999999998,null,2]
[null,"Valencia",null,"Valencia",2019,360.94,5.399,null,3]
[null,"Virginia",null,"Virginia",2019,360.94,4.9039999999999999]
[null,null,null,"Runner ",2020,354.55,4.8120000000000003]
[null,2019,null,"Spanish",2020,345.57,4.7880000000000003]
[null,2020,null,"Valencia",2020,358.74,5.3710000000000004]
[null,2021,null,"Virginia",2020,358.74,4.9080000000000004]
[null,2022,null,"Runner ",2021,354.89,4.8120000000000003]
[null,2023,null,"Spanish",2021,343.05,4.7880000000000003]
[null,2024,null,"Valencia",2021,357.7,5.3929999999999998]
[null,null,null,"Virginia",2021,357.7,4.9080000000000004]
[null,null,null,"Runner ",2022,354.68,4.7880000000000003]
[null,null,null,"Spanish",2022,343.41,4.7640000000000002]
[null,null,null,"Valencia",2022,358.31,5.4080000000000004]
[null,null,null,"Virginia",2022,358.31,4.8840000000000003]
[null,null,null,"Runner ",2023,354.41,4.7960000000000003]
[null,null,null,"Spanish",2023,344.27,4.7720000000000002]
[null,null,null,"Valencia",2023,359.76,5.4219999999999997]
[null,null,null,"Virginia",2023,359.76,4.8920000000000003]
[null,null,null,"Runner ",2024,354.33,4.8289999999999997]
[null,null,null,"Spanish",2024,344.85,4.8049999999999997]
[null,null,null,"Valencia",2024,360.21,5.3920000000000003]
[null,null,null,"Virginia",2024,360.21,4.9260000000000002]

{"sheet":"Sheet3","index":3,"n_rows":349,"n_cols":4,"rows_kept":349,"cut":false,"hidden":true,"merged":[]}
[0.01,0,null,"Damage"]
[0.02,0]
[0.03,0]
[0.04,0]
[0.05,0]
[6.0000000000000005E-2,0]
[6.9999999999999993E-2,0]
[0.08,0]
[0.09,0]
[9.9999999999999992E-2,0]
[0.11,0]
[0.12,0]
[0.13,0]
[0.14000000000000001,0]
[0.15000000000000002,0]
[0.16,0]
[0.17,0]
[0.18000000000000002,0]
[0.19,0]
[0.2,0]
[0.21000000000000002,0]
[0.22,0]
[0.23,0]
[0.24000000000000002,0]
[0.25,0]
[0.26,0]
[0.27,0]
[0.28000000000000003,0]
[0.29000000000000004,0]
[0.3,0]
[0.31,0]
[0.32,0]
[0.33,0]
[0.34,0]
[0.35000000000000003,0]
[0.36000000000000004,0]
[0.37,0]
[0.38,0]
[0.39,0]
[0.4,0]
[0.41000000000000003,0]
[0.42000000000000004,0]
[0.43,0]
[0.44,0]
[0.45,0]
[0.46,0]
[0.47000000000000003,0]
[0.48000000000000004,0]
[0.49,0]
[0.5,0]
[0.51,0]
[0.52,0]
[0.53,0]
[0.54,0]
[0.55000000000000004,0]
[0.56000000000000005,0]
[0.57000000000000006,0]
[0.58000000000000007,0]
[0.59,0]
[0.6,0]
[0.61,0]
[0.62,0]
[0.63,0]
[0.64,0]
[0.65,0]
[0.66,0]
[0.67,0]
[0.68,0]
[0.69000000000000006,0]
[0.70000000000000007,0]
[0.71000000000000008,0]
[0.72,0]
[0.73,0]
[0.74,0]
[0.75,0]
[0.76,0]
[0.77,0]
[0.78,0]
[0.79,0]
[0.8,0]
[0.81,0]
[0.82000000000000006,0]
[0.83000000000000007,0]
[0.84000000000000008,0]
[0.85,0]
[0.86,0]
[0.87,0]
[0.88,0]
[0.89,0]
[0.9,0]
[0.91,0]
[0.92,0]
[0.93,0]
[0.94000000000000006,0]
[0.95000000000000007,0]
[0.96000000000000008,0]
[0.97,0]
[0.98,0]
[0.99,0]
[1,0]
[1.01,0]
[1.02,0]
[1.03,0]
[1.04,0]
[1.05,0]
[1.06,0]
[1.07,0]
[1.08,0]
[1.0900000000000001,0]
[1.1000000000000001,0]
[1.1100000000000001,0]
[1.1200000000000001,0]
[1.1300000000000001,0]
[1.1400000000000001,0]
[1.1500000000000001,0]
[1.1600000000000001,0]
[1.17,0]
[1.18,0]
[1.19,0]
[1.2,0]
[1.21,0]
[1.22,0]
[1.23,0]
[1.24,0]
[1.25,0]
[1.26,0]
[1.27,0]
[1.28,0]
[1.29,0]
[1.3,0]
[1.31,0]
[1.32,0]
[1.33,0]
[1.34,0]
[1.35,0]
[1.36,0]
[1.37,0]
[1.3800000000000001,0]
[1.3900000000000001,0]
[1.4000000000000001,0]
[1.4100000000000001,0]
[1.42,0]
[1.43,0]
[1.44,0]
[1.45,0]
[1.46,0]
[1.47,0]
[1.48,0]
[1.49,0]
[1.5,3.4]
[1.51,3.4]
[1.52,3.4]
[1.53,3.4]
[1.54,3.4]
[1.55,3.4]
[1.56,3.4]
[1.57,3.4]
[1.58,3.4]
[1.59,3.4]
[1.6,3.4]
[1.61,3.4]
[1.62,3.4]
[1.6300000000000001,3.4]
[1.6400000000000001,3.4]
[1.6500000000000001,3.4]
[1.6600000000000001,3.4]
[1.6700000000000002,3.4]
[1.68,3.4]
[1.69,3.4]
[1.7,3.4]
[1.71,3.4]
[1.72,3.4]
[1.73,3.4]
[1.74,3.4]
[1.75,3.4]
[1.76,3.4]
[1.77,3.4]
[1.78,3.4]
[1.79,3.4]
[1.8,3.4]
[1.81,3.4]
[1.82,3.4]
[1.83,3.4]
[1.84,3.4]
[1.85,3.4]
[1.86,3.4]
[1.87,3.4]
[1.8800000000000001,3.4]
[1.8900000000000001,3.4]
[1.9000000000000001,3.4]
[1.9100000000000001,3.4]
[1.9200000000000002,3.4]
[1.93,3.4]
[1.94,3.4]
[1.95,3.4]
[1.96,3.4]
[1.97,3.4]
[1.98,3.4]
[1.99,3.4]
[2,3.4]
{"$rows_left_out":150}
{"sheet":"Sheet4","index":4,"n_rows":2050,"n_cols":4,"rows_kept":2050,"cut":false,"hidden":true,"merged":[]}
[0.01,0,null,"Foreign Material"]
[0.02,0]
[0.03,0]
[0.04,0]
[0.05,0]
[6.0000000000000005E-2,0]
[6.9999999999999993E-2,0]
[0.08,0]
[0.09,0]
[9.9999999999999992E-2,0]
[0.11,0]
[0.12,0]
[0.13,0]
[0.14000000000000001,0]
[0.15000000000000002,0]
[0.16,0]
[0.17,0]
[0.18000000000000002,0]
[0.19,0]
[0.2,0]
[0.21000000000000002,0]
[0.22,0]
[0.23,0]
[0.24000000000000002,0]
[0.25,0]
[0.26,0]
[0.27,0]
[0.28000000000000003,0]
[0.29000000000000004,0]
[0.3,0]
[0.31,0]
[0.32,0]
[0.33,0]
[0.34,0]
[0.35000000000000003,0]
[0.36000000000000004,0]
[0.37,0]
[0.38,0]
[0.39,0]
[0.4,0]
[0.41000000000000003,0]
[0.42000000000000004,0]
[0.43,0]
[0.44,0]
[0.45,0]
[0.46,0]
[0.47000000000000003,0]
[0.48000000000000004,0]
[0.49,0]
[0.5,0]
[0.51,0]
[0.52,0]
[0.53,0]
[0.54,0]
[0.55000000000000004,0]
[0.56000000000000005,0]
[0.57000000000000006,0]
[0.58000000000000007,0]
[0.59,0]
[0.6,0]
[0.61,0]
[0.62,0]
[0.63,0]
[0.64,0]
[0.65,0]
[0.66,0]
[0.67,0]
[0.68,0]
[0.69000000000000006,0]
[0.70000000000000007,0]
[0.71000000000000008,0]
[0.72,0]
[0.73,0]
[0.74,0]
[0.75,0]
[0.76,0]
[0.77,0]
[0.78,0]
[0.79,0]
[0.8,0]
[0.81,0]
[0.82000000000000006,0]
[0.83000000000000007,0]
[0.84000000000000008,0]
[0.85,0]
[0.86,0]
[0.87,0]
[0.88,0]
[0.89,0]
[0.9,0]
[0.91,0]
[0.92,0]
[0.93,0]
[0.94000000000000006,0]
[0.95000000000000007,0]
[0.96000000000000008,0]
[0.97,0]
[0.98,0]
[0.99,0]
[1,0]
[1.01,0]
[1.02,0]
[1.03,0]
[1.04,0]
[1.05,0]
[1.06,0]
[1.07,0]
[1.08,0]
[1.0900000000000001,0]
[1.1000000000000001,0]
[1.1100000000000001,0]
[1.1200000000000001,0]
[1.1300000000000001,0]
[1.1400000000000001,0]
[1.1500000000000001,0]
[1.1600000000000001,0]
[1.17,0]
[1.18,0]
[1.19,0]
[1.2,0]
[1.21,0]
[1.22,0]
[1.23,0]
[1.24,0]
[1.25,0]
[1.26,0]
[1.27,0]
[1.28,0]
[1.29,0]
[1.3,0]
[1.31,0]
[1.32,0]
[1.33,0]
[1.34,0]
[1.35,0]
[1.36,0]
[1.37,0]
[1.3800000000000001,0]
[1.3900000000000001,0]
[1.4000000000000001,0]
[1.4100000000000001,0]
[1.42,0]
[1.43,0]
[1.44,0]
[1.45,0]
[1.46,0]
[1.47,0]
[1.48,0]
[1.49,0]
[1.5,0]
[1.51,0]
[1.52,0]
[1.53,0]
[1.54,0]
[1.55,0]
[1.56,0]
[1.57,0]
[1.58,0]
[1.59,0]
[1.6,0]
[1.61,0]
[1.62,0]
[1.6300000000000001,0]
[1.6400000000000001,0]
[1.6500000000000001,0]
[1.6600000000000001,0]
[1.6700000000000002,0]
[1.68,0]
[1.69,0]
[1.7,0]
[1.71,0]
[1.72,0]
[1.73,0]
[1.74,0]
[1.75,0]
[1.76,0]
[1.77,0]
[1.78,0]
[1.79,0]
[1.8,0]
[1.81,0]
[1.82,0]
[1.83,0]
[1.84,0]
[1.85,0]
[1.86,0]
[1.87,0]
[1.8800000000000001,0]
[1.8900000000000001,0]
[1.9000000000000001,0]
[1.9100000000000001,0]
[1.9200000000000002,0]
[1.93,0]
[1.94,0]
[1.95,0]
[1.96,0]
[1.97,0]
[1.98,0]
[1.99,0]
[2,0]
{"$rows_left_out":1851}
{"sheet":"Sheet5","index":5,"n_rows":1749,"n_cols":4,"rows_kept":1749,"cut":false,"hidden":true,"merged":[]}
[0.01,0,null,"Sound Splits"]
[0.02,0]
[0.03,0]
[0.04,0]
[0.05,0]
[6.0000000000000005E-2,0]
[6.9999999999999993E-2,0]
[0.08,0]
[0.09,0]
[9.9999999999999992E-2,0]
[0.11,0]
[0.12,0]
[0.13,0]
[0.14000000000000001,0]
[0.15000000000000002,0]
[0.16,0]
[0.17,0]
[0.18000000000000002,0]
[0.19,0]
[0.2,0]
[0.21000000000000002,0]
[0.22,0]
[0.23,0]
[0.24000000000000002,0]
[0.25,0]
[0.26,0]
[0.27,0]
[0.28000000000000003,0]
[0.29000000000000004,0]
[0.3,0]
[0.31,0]
[0.32,0]
[0.33,0]
[0.34,0]
[0.35000000000000003,0]
[0.36000000000000004,0]
[0.37,0]
[0.38,0]
[0.39,0]
[0.4,0]
[0.41000000000000003,0]
[0.42000000000000004,0]
[0.43,0]
[0.44,0]
[0.45,0]
[0.46,0]
[0.47000000000000003,0]
[0.48000000000000004,0]
[0.49,0]
[0.5,0]
[0.51,0]
[0.52,0]
[0.53,0]
[0.54,0]
[0.55000000000000004,0]
[0.56000000000000005,0]
[0.57000000000000006,0]
[0.58000000000000007,0]
[0.59,0]
[0.6,0]
[0.61,0]
[0.62,0]
[0.63,0]
[0.64,0]
[0.65,0]
[0.66,0]
[0.67,0]
[0.68,0]
[0.69000000000000006,0]
[0.70000000000000007,0]
[0.71000000000000008,0]
[0.72,0]
[0.73,0]
[0.74,0]
[0.75,0]
[0.76,0]
[0.77,0]
[0.78,0]
[0.79,0]
[0.8,0]
[0.81,0]
[0.82000000000000006,0]
[0.83000000000000007,0]
[0.84000000000000008,0]
[0.85,0]
[0.86,0]
[0.87,0]
[0.88,0]
[0.89,0]
[0.9,0]
[0.91,0]
[0.92,0]
[0.93,0]
[0.94000000000000006,0]
[0.95000000000000007,0]
[0.96000000000000008,0]
[0.97,0]
[0.98,0]
[0.99,0]
[1,0]
[1.01,0]
[1.02,0]
[1.03,0]
[1.04,0]
[1.05,0]
[1.06,0]
[1.07,0]
[1.08,0]
[1.0900000000000001,0]
[1.1000000000000001,0]
[1.1100000000000001,0]
[1.1200000000000001,0]
[1.1300000000000001,0]
[1.1400000000000001,0]
[1.1500000000000001,0]
[1.1600000000000001,0]
[1.17,0]
[1.18,0]
[1.19,0]
[1.2,0]
[1.21,0]
[1.22,0]
[1.23,0]
[1.24,0]
[1.25,0]
[1.26,0]
[1.27,0]
[1.28,0]
[1.29,0]
[1.3,0]
[1.31,0]
[1.32,0]
[1.33,0]
[1.34,0]
[1.35,0]
[1.36,0]
[1.37,0]
[1.3800000000000001,0]
[1.3900000000000001,0]
[1.4000000000000001,0]
[1.4100000000000001,0]
[1.42,0]
[1.43,0]
[1.44,0]
[1.45,0]
[1.46,0]
[1.47,0]
[1.48,0]
[1.49,0]
[1.5,0]
[1.51,0]
[1.52,0]
[1.53,0]
[1.54,0]
[1.55,0]
[1.56,0]
[1.57,0]
[1.58,0]
[1.59,0]
[1.6,0]
[1.61,0]
[1.62,0]
[1.6300000000000001,0]
[1.6400000000000001,0]
[1.6500000000000001,0]
[1.6600000000000001,0]
[1.6700000000000002,0]
[1.68,0]
[1.69,0]
[1.7,0]
[1.71,0]
[1.72,0]
[1.73,0]
[1.74,0]
[1.75,0]
[1.76,0]
[1.77,0]
[1.78,0]
[1.79,0]
[1.8,0]
[1.81,0]
[1.82,0]
[1.83,0]
[1.84,0]
[1.85,0]
[1.86,0]
[1.87,0]
[1.8800000000000001,0]
[1.8900000000000001,0]
[1.9000000000000001,0]
[1.9100000000000001,0]
[1.9200000000000002,0]
[1.93,0]
[1.94,0]
[1.95,0]
[1.96,0]
[1.97,0]
[1.98,0]
[1.99,0]
[2,0]
{"$rows_left_out":1549}